Reaction Details
TargetLeukotriene A-4 hydrolase
LigandBDBM50266172
Substrate/Competitorn/a
Meas. Tech.ChEMBL_544515 (CHEMBL1013487)
IC50 200±n/a nM
Citation Enomoto, HMorikawa, YMiyake, YTsuji, FMizuchi, MSuhara, HFujimura, KHoriuchi, MBan, M Synthesis and biological evaluation of N-mercaptoacylcysteine derivatives as leukotriene A4 hydrolase inhibitors. Bioorg Med Chem Lett19:442-6 (2008) 
 
Leukotriene A-4 hydrolase
Name:Leukotriene A-4 hydrolase
Type:PROTEIN
Mol. Mass.:68972.78
Organism:Cavia porcellus
Description:ChEMBL_544515
Residue:611
BDBM50266172
NameBDBM50266172
Synonyms:(R)-3-(4-isopropylbenzylthio)-2-((S)-3-mercapto-2-methylpropanamido)propanoic acid | CHEMBL461022
TypeSmall organic molecule
Emp. Form.C17H25NO3S2
Mol. Mass.355.515
SMILESCC(C)c1ccc(CSC[C@H](NC(=O)[C@H](C)CS)C(O)=O)cc1