Reaction Details
TargetLeukotriene A-4 hydrolase
LigandBDBM50266212
Substrate/Competitorn/a
Meas. Tech.ChEMBL_544515 (CHEMBL1013487)
IC50 891±n/a nM
Citation Enomoto, HMorikawa, YMiyake, YTsuji, FMizuchi, MSuhara, HFujimura, KHoriuchi, MBan, M Synthesis and biological evaluation of N-mercaptoacylcysteine derivatives as leukotriene A4 hydrolase inhibitors. Bioorg Med Chem Lett19:442-6 (2008) 
 
Leukotriene A-4 hydrolase
Name:Leukotriene A-4 hydrolase
Type:PROTEIN
Mol. Mass.:68972.78
Organism:Cavia porcellus
Description:ChEMBL_544515
Residue:611
BDBM50266212
NameBDBM50266212
Synonyms:(R)-3-(4-(diethylamino)benzylthio)-2-((S)-3-mercapto-2-methylpropanamido)propanoic acid | CHEMBL457795
TypeSmall organic molecule
Emp. Form.C18H28N2O3S2
Mol. Mass.384.557
SMILESCCN(CC)c1ccc(CSC[C@H](NC(=O)[C@H](C)CS)C(O)=O)cc1