Reaction Details
TargetLeukotriene A-4 hydrolase
LigandBDBM50266210
Substrate/Competitorn/a
Meas. Tech.ChEMBL_544515 (CHEMBL1013487)
IC50 640±n/a nM
Citation Enomoto, HMorikawa, YMiyake, YTsuji, FMizuchi, MSuhara, HFujimura, KHoriuchi, MBan, M Synthesis and biological evaluation of N-mercaptoacylcysteine derivatives as leukotriene A4 hydrolase inhibitors. Bioorg Med Chem Lett19:442-6 (2008) 
 
Leukotriene A-4 hydrolase
Name:Leukotriene A-4 hydrolase
Type:PROTEIN
Mol. Mass.:68972.78
Organism:Cavia porcellus
Description:ChEMBL_544515
Residue:611
BDBM50266210
NameBDBM50266210
Synonyms:(R)-3-(4-ethoxybenzylthio)-2-((S)-3-mercapto-2-methylpropanamido)propanoic acid | CHEMBL457571
TypeSmall organic molecule
Emp. Form.C16H23NO4S2
Mol. Mass.357.488
SMILESCCOc1ccc(CSC[C@H](NC(=O)[C@H](C)CS)C(O)=O)cc1