Reaction Details
TargetLeukotriene A-4 hydrolase
LigandBDBM50266136
Substrate/Competitorn/a
Meas. Tech.ChEMBL_544515 (CHEMBL1013487)
IC50 15.0±n/a nM
Citation Enomoto, HMorikawa, YMiyake, YTsuji, FMizuchi, MSuhara, HFujimura, KHoriuchi, MBan, M Synthesis and biological evaluation of N-mercaptoacylcysteine derivatives as leukotriene A4 hydrolase inhibitors. Bioorg Med Chem Lett19:442-6 (2008) 
 
Leukotriene A-4 hydrolase
Name:Leukotriene A-4 hydrolase
Type:PROTEIN
Mol. Mass.:68972.78
Organism:Cavia porcellus
Description:ChEMBL_544515
Residue:611
BDBM50266136
NameBDBM50266136
Synonyms:(R)-3-(4-iodobenzylthio)-2-((S)-3-mercapto-2-methylpropanamido)propanoic acid | CHEMBL459959
TypeSmall organic molecule
Emp. Form.C14H18INO3S2
Mol. Mass.439.332
SMILESC[C@H](CS)C(=O)N[C@@H](CSCc1ccc(I)cc1)C(O)=O