Reaction Details
TargetLeukotriene A-4 hydrolase
LigandBDBM50266138
Substrate/Competitorn/a
Meas. Tech.ChEMBL_544515 (CHEMBL1013487)
IC50 140±n/a nM
Citation Enomoto, HMorikawa, YMiyake, YTsuji, FMizuchi, MSuhara, HFujimura, KHoriuchi, MBan, M Synthesis and biological evaluation of N-mercaptoacylcysteine derivatives as leukotriene A4 hydrolase inhibitors. Bioorg Med Chem Lett19:442-6 (2008) 
 
Leukotriene A-4 hydrolase
Name:Leukotriene A-4 hydrolase
Type:PROTEIN
Mol. Mass.:68972.78
Organism:Cavia porcellus
Description:ChEMBL_544515
Residue:611
BDBM50266138
NameBDBM50266138
Synonyms:(R)-2-((S)-3-mercapto-2-methylpropanamido)-3-(4-(trifluoromethyl)benzylthio)propanoic acid | CHEMBL459961
TypeSmall organic molecule
Emp. Form.C15H18F3NO3S2
Mol. Mass.381.434
SMILESC[C@H](CS)C(=O)N[C@@H](CSCc1ccc(cc1)C(F)(F)F)C(O)=O