Reaction Details
TargetLeukotriene A-4 hydrolase
LigandBDBM50266174
Substrate/Competitorn/a
Meas. Tech.ChEMBL_544515 (CHEMBL1013487)
IC50 600±n/a nM
Citation Enomoto, HMorikawa, YMiyake, YTsuji, FMizuchi, MSuhara, HFujimura, KHoriuchi, MBan, M Synthesis and biological evaluation of N-mercaptoacylcysteine derivatives as leukotriene A4 hydrolase inhibitors. Bioorg Med Chem Lett19:442-6 (2008) 
 
Leukotriene A-4 hydrolase
Name:Leukotriene A-4 hydrolase
Type:PROTEIN
Mol. Mass.:68972.78
Organism:Cavia porcellus
Description:ChEMBL_544515
Residue:611
BDBM50266174
NameBDBM50266174
Synonyms:(R)-3-(biphenyl-4-ylmethylthio)-2-((S)-3-mercapto-2-methylpropanamido)propanoic acid | CHEMBL463520
TypeSmall organic molecule
Emp. Form.C20H23NO3S2
Mol. Mass.389.532
SMILESC[C@H](CS)C(=O)N[C@@H](CSCc1ccc(cc1)-c1ccccc1)C(O)=O