Reaction Details
TargetLeukotriene A-4 hydrolase
LigandBDBM50266079
Substrate/Competitorn/a
Meas. Tech.ChEMBL_544515 (CHEMBL1013487)
IC50 470±n/a nM
Citation Enomoto, HMorikawa, YMiyake, YTsuji, FMizuchi, MSuhara, HFujimura, KHoriuchi, MBan, M Synthesis and biological evaluation of N-mercaptoacylcysteine derivatives as leukotriene A4 hydrolase inhibitors. Bioorg Med Chem Lett19:442-6 (2008) 
 
Leukotriene A-4 hydrolase
Name:Leukotriene A-4 hydrolase
Type:PROTEIN
Mol. Mass.:68972.78
Organism:Cavia porcellus
Description:ChEMBL_544515
Residue:611
BDBM50266079
NameBDBM50266079
Synonyms:(R)-3-(4-(dimethylamino)benzylthio)-2-(2-mercaptoacetamido)propanoic acid | CHEMBL456035
TypeSmall organic molecule
Emp. Form.C14H20N2O3S2
Mol. Mass.328.45
SMILESCN(C)c1ccc(CSC[C@H](NC(=O)CS)C(O)=O)cc1