Reaction Details
TargetLeukotriene A-4 hydrolase
LigandBDBM50266110
Substrate/Competitorn/a
Meas. Tech.ChEMBL_544515 (CHEMBL1013487)
IC50>10000±n/a nM
Citation Enomoto, HMorikawa, YMiyake, YTsuji, FMizuchi, MSuhara, HFujimura, KHoriuchi, MBan, M Synthesis and biological evaluation of N-mercaptoacylcysteine derivatives as leukotriene A4 hydrolase inhibitors. Bioorg Med Chem Lett19:442-6 (2008) 
 
Leukotriene A-4 hydrolase
Name:Leukotriene A-4 hydrolase
Type:PROTEIN
Mol. Mass.:68972.78
Organism:Cavia porcellus
Description:ChEMBL_544515
Residue:611
BDBM50266110
NameBDBM50266110
Synonyms:(R)-3-(4-(dimethylamino)benzylthio)-2-(4-mercaptobutanamido)propanoic acid | CHEMBL445489
TypeSmall organic molecule
Emp. Form.C16H24N2O3S2
Mol. Mass.356.503
SMILESCN(C)c1ccc(CSC[C@H](NC(=O)CCCS)C(O)=O)cc1