Reaction Details
TargetLeukotriene A-4 hydrolase
LigandBDBM50266247
Substrate/Competitorn/a
Meas. Tech.ChEMBL_544515 (CHEMBL1013487)
IC50 55±n/a nM
Citation Enomoto, HMorikawa, YMiyake, YTsuji, FMizuchi, MSuhara, HFujimura, KHoriuchi, MBan, M Synthesis and biological evaluation of N-mercaptoacylcysteine derivatives as leukotriene A4 hydrolase inhibitors. Bioorg Med Chem Lett19:442-6 (2008) 
 
Leukotriene A-4 hydrolase
Name:Leukotriene A-4 hydrolase
Type:PROTEIN
Mol. Mass.:68972.78
Organism:Cavia porcellus
Description:ChEMBL_544515
Residue:611
BDBM50266247
NameBDBM50266247
Synonyms:(2R)-3-(1-(4-isopropylphenyl)ethylthio)-2-((S)-3-mercapto-2-methylpropanamido)propanoic acid | CHEMBL458238
TypeSmall organic molecule
Emp. Form.C18H27NO3S2
Mol. Mass.369.542
SMILESCC(C)c1ccc(cc1)C(C)SC[C@H](NC(=O)[C@H](C)CS)C(O)=O