Reaction Details
TargetLeukotriene A-4 hydrolase
LigandBDBM50266276
Substrate/Competitorn/a
Meas. Tech.ChEMBL_544515 (CHEMBL1013487)
IC50 180±n/a nM
Citation Enomoto, HMorikawa, YMiyake, YTsuji, FMizuchi, MSuhara, HFujimura, KHoriuchi, MBan, M Synthesis and biological evaluation of N-mercaptoacylcysteine derivatives as leukotriene A4 hydrolase inhibitors. Bioorg Med Chem Lett19:442-6 (2008) 
 
Leukotriene A-4 hydrolase
Name:Leukotriene A-4 hydrolase
Type:PROTEIN
Mol. Mass.:68972.78
Organism:Cavia porcellus
Description:ChEMBL_544515
Residue:611
BDBM50266276
NameBDBM50266276
Synonyms:(2R)-3-(1-(4-isopropylphenyl)butylthio)-2-((S)-3-mercapto-2-methylpropanamido)propanoic acid | CHEMBL458450
TypeSmall organic molecule
Emp. Form.C20H31NO3S2
Mol. Mass.397.595
SMILESCCCC(SC[C@H](NC(=O)[C@H](C)CS)C(O)=O)c1ccc(cc1)C(C)C