Reaction Details
TargetLeukotriene A-4 hydrolase
LigandBDBM50266279
Substrate/Competitorn/a
Meas. Tech.ChEMBL_544515 (CHEMBL1013487)
IC50 91±n/a nM
Citation Enomoto, HMorikawa, YMiyake, YTsuji, FMizuchi, MSuhara, HFujimura, KHoriuchi, MBan, M Synthesis and biological evaluation of N-mercaptoacylcysteine derivatives as leukotriene A4 hydrolase inhibitors. Bioorg Med Chem Lett19:442-6 (2008) 
 
Leukotriene A-4 hydrolase
Name:Leukotriene A-4 hydrolase
Type:PROTEIN
Mol. Mass.:68972.78
Organism:Cavia porcellus
Description:ChEMBL_544515
Residue:611
BDBM50266279
NameBDBM50266279
Synonyms:(2R)-3-((4-isopropylphenyl)(phenyl)methylthio)-2-((S)-3-mercapto-2-methylpropanamido)propanoic acid | CHEMBL516325
TypeSmall organic molecule
Emp. Form.C23H29NO3S2
Mol. Mass.431.611
SMILESCC(C)c1ccc(cc1)C(SC[C@H](NC(=O)[C@H](C)CS)C(O)=O)c1ccccc1