Reaction Details
TargetLeukotriene A-4 hydrolase
LigandBDBM50266315
Substrate/Competitorn/a
Meas. Tech.ChEMBL_544515 (CHEMBL1013487)
IC50 210±n/a nM
Citation Enomoto, HMorikawa, YMiyake, YTsuji, FMizuchi, MSuhara, HFujimura, KHoriuchi, MBan, M Synthesis and biological evaluation of N-mercaptoacylcysteine derivatives as leukotriene A4 hydrolase inhibitors. Bioorg Med Chem Lett19:442-6 (2008) 
 
Leukotriene A-4 hydrolase
Name:Leukotriene A-4 hydrolase
Type:PROTEIN
Mol. Mass.:68972.78
Organism:Cavia porcellus
Description:ChEMBL_544515
Residue:611
BDBM50266315
NameBDBM50266315
Synonyms:(2R)-3-((4-cyclohexylphenyl)(phenyl)methylthio)-2-((S)-3-mercapto-2-methylpropanamido)propanoic acid | CHEMBL456044
TypeSmall organic molecule
Emp. Form.C26H33NO3S2
Mol. Mass.471.675
SMILESC[C@H](CS)C(=O)N[C@@H](CSC(c1ccccc1)c1ccc(cc1)C1CCCCC1)C(O)=O