Reaction Details
TargetLeukotriene A-4 hydrolase
LigandBDBM50266316
Substrate/Competitorn/a
Meas. Tech.ChEMBL_544515 (CHEMBL1013487)
IC50 55±n/a nM
Citation Enomoto, HMorikawa, YMiyake, YTsuji, FMizuchi, MSuhara, HFujimura, KHoriuchi, MBan, M Synthesis and biological evaluation of N-mercaptoacylcysteine derivatives as leukotriene A4 hydrolase inhibitors. Bioorg Med Chem Lett19:442-6 (2008) 
 
Leukotriene A-4 hydrolase
Name:Leukotriene A-4 hydrolase
Type:PROTEIN
Mol. Mass.:68972.78
Organism:Cavia porcellus
Description:ChEMBL_544515
Residue:611
BDBM50266316
NameBDBM50266316
Synonyms:(R)-3-(2-(4-cyclohexylphenyl)propan-2-ylthio)-2-((S)-3-mercapto-2-methylpropanamido)propanoic acid | CHEMBL456045
TypeSmall organic molecule
Emp. Form.C22H33NO3S2
Mol. Mass.423.632
SMILESC[C@H](CS)C(=O)N[C@@H](CSC(C)(C)c1ccc(cc1)C1CCCCC1)C(O)=O