Reaction Details
TargetPolyphenol oxidase 2
LigandBDBM50251001
Substrate/Competitorn/a
Meas. Tech.ChEMBL_559526 (CHEMBL1018999)
IC50 1700±n/a nM
Citation Baek, YSRyu, YBCurtis-Long, MJHa, TJRengasamy, RYang, MSPark, KH Tyrosinase inhibitory effects of 1,3-diphenylpropanes from Broussonetia kazinoki. Bioorg Med Chem17:35-41 (2008) 
 
Polyphenol oxidase 2
Name:Polyphenol oxidase 2
Type:Protein
Mol. Mass.:63923.66
Organism:Agaricus bisporus (Common mushroom)
Description:O42713
Residue:556
BDBM50251001
NameBDBM50251001
Synonyms:CHEMBL457677 | Kazinol F
TypeSmall organic molecule
Emp. Form.C25H32O4
Mol. Mass.396.5192
SMILES[#6]\[#6](-[#6])=[#6]\[#6]-c1c(-[#6]-[#6]-[#6]-c2ccc(-[#8])cc2-[#8])cc(-[#8])c(-[#8])c1-[#6]\[#6]=[#6](/[#6])-[#6]