Reaction Details
TargetDelta-type opioid receptor
LigandBDBM50273932
Substrate/Competitorn/a
Meas. Tech.ChEMBL_561948 (CHEMBL1021466)
Ki>10000±n/a nM
Citation Kurimura, MLiu, HSulima, AHashimoto, APrzybyl, AKOhshima, EKodato, SDeschamps, JRDersch, CMRothman, RBLee, YSJacobson, AERice, KC Probes for narcotic receptor mediated phenomena. 37. Synthesis and opioid binding affinity of the final pair of oxide-bridged phenylmorphans, the ortho- and para-b-isomers and their N-phenethyl analogues, and the synthesis of the N-phenethyl analogues of the ortho- and para-d-isomers. J Med Chem51:7866-81 (2008) 
 
Delta-type opioid receptor
Name:Delta-type opioid receptor
Type:G Protein-Coupled Receptor (GPCR)
Mol. Mass.:40382.98
Organism:Homo sapiens (Human)
Description:Competition binding assays were carried out using membrane preparations from transfected HN9.10 cells that constitutively expressed the delta opioid receptor.
Residue:372
BDBM50273932
NameBDBM50273932
Synonyms:(4R*,6aS*,11bR*)-2,3,4,5,6,6a-Hexahydro-3-methyl-1H-4,11bmethanobenzofuro[3,2-d]azocine-10-ol | CHEMBL517866
TypeSmall organic molecule
Emp. Form.C15H19NO2
Mol. Mass.245.3169
SMILESCN1CC[C@@]23C[C@@H]1CC[C@H]2Oc1ccc(O)cc31