Reaction Details
TargetKappa-type opioid receptor
LigandBDBM50273932
Substrate/Competitorn/a
Meas. Tech.ChEMBL_561950 (CHEMBL1021468)
Ki 10000±n/a nM
Citation Kurimura, MLiu, HSulima, AHashimoto, APrzybyl, AKOhshima, EKodato, SDeschamps, JRDersch, CMRothman, RBLee, YSJacobson, AERice, KC Probes for narcotic receptor mediated phenomena. 37. Synthesis and opioid binding affinity of the final pair of oxide-bridged phenylmorphans, the ortho- and para-b-isomers and their N-phenethyl analogues, and the synthesis of the N-phenethyl analogues of the ortho- and para-d-isomers. J Med Chem51:7866-81 (2008) 
 
Kappa-type opioid receptor
Name:Kappa-type opioid receptor
Type:G Protein-Coupled Receptor (GPCR)
Mol. Mass.:42648.76
Organism:Homo sapiens (Human)
Description:P41145
Residue:380
BDBM50273932
NameBDBM50273932
Synonyms:(4R*,6aS*,11bR*)-2,3,4,5,6,6a-Hexahydro-3-methyl-1H-4,11bmethanobenzofuro[3,2-d]azocine-10-ol | CHEMBL517866
TypeSmall organic molecule
Emp. Form.C15H19NO2
Mol. Mass.245.3169
SMILESCN1CC[C@@]23C[C@@H]1CC[C@H]2Oc1ccc(O)cc31