Reaction Details
TargetMu-type opioid receptor
LigandBDBM50273416
Substrate/Competitorn/a
Meas. Tech.ChEMBL_561947 (CHEMBL1021465)
Ki 1220±n/a nM
Citation Kurimura, MLiu, HSulima, AHashimoto, APrzybyl, AKOhshima, EKodato, SDeschamps, JRDersch, CMRothman, RBLee, YSJacobson, AERice, KC Probes for narcotic receptor mediated phenomena. 37. Synthesis and opioid binding affinity of the final pair of oxide-bridged phenylmorphans, the ortho- and para-b-isomers and their N-phenethyl analogues, and the synthesis of the N-phenethyl analogues of the ortho- and para-d-isomers. J Med Chem51:7866-81 (2008) 
 
Mu-type opioid receptor
Name:Mu-type opioid receptor
Type:G Protein-Coupled Receptor (GPCR)
Mol. Mass.:44789.51
Organism:Homo sapiens (Human)
Description:P35372
Residue:400
BDBM50273416
NameBDBM50273416
Synonyms:(3R*,6aS*,11aR*)-1,3,4,5,6,11a-Hexahydro-2-phenethyl-2H-3,6a-methanobenzofuro[2,3-c]azocin-10-ol | CHEMBL455906
TypeSmall organic molecule
Emp. Form.C22H25NO2
Mol. Mass.335.4394
SMILESOc1ccc2O[C@H]3CN(CCc4ccccc4)[C@@H]4CCC[C@]3(C4)c2c1