Reaction Details
TargetProstaglandin G/H synthase 1
LigandBDBM50246685
Substrate/Competitorn/a
Meas. Tech.ChEMBL_562005 (CHEMBL1010943)
IC50 234000±n/a nM
Citation Sinning, CWatzer, BCoste, ONüsing, RMOtt, ILigresti, ADi Marzo, VImming, P New analgesics synthetically derived from the paracetamol metabolite N-(4-hydroxyphenyl)-(5Z,8Z,11Z,14Z)-icosatetra-5,8,11,14-enamide. J Med Chem51:7800-5 (2008) 
 
Prostaglandin G/H synthase 1
Name:Prostaglandin G/H synthase 1
Type:Enzyme
Mol. Mass.:68692.62
Organism:Homo sapiens (Human)
Description:P23219
Residue:599
BDBM50246685
NameBDBM50246685
Synonyms:CHEMBL498882 | N-(4-hydroxy-3-methoxyphenyl)acetamide
TypeSmall organic molecule
Emp. Form.C9H11NO3
Mol. Mass.181.1885
SMILESCOc1cc(NC(C)=O)ccc1O