Reaction Details
TargetProstaglandin G/H synthase 2
LigandBDBM50246685
Substrate/Competitorn/a
Meas. Tech.ChEMBL_562006 (CHEMBL1010944)
IC50 138000±n/a nM
Citation Sinning, CWatzer, BCoste, ONüsing, RMOtt, ILigresti, ADi Marzo, VImming, P New analgesics synthetically derived from the paracetamol metabolite N-(4-hydroxyphenyl)-(5Z,8Z,11Z,14Z)-icosatetra-5,8,11,14-enamide. J Med Chem51:7800-5 (2008) 
 
Prostaglandin G/H synthase 2
Name:Prostaglandin G/H synthase 2
Type:Enzyme
Mol. Mass.:69003.89
Organism:Homo sapiens (Human)
Description:Recombinant Cox-2 provided by Cayman (Cayman Chemical Co.,Ann Arbor, MI).
Residue:604
BDBM50246685
NameBDBM50246685
Synonyms:CHEMBL498882 | N-(4-hydroxy-3-methoxyphenyl)acetamide
TypeSmall organic molecule
Emp. Form.C9H11NO3
Mol. Mass.181.1885
SMILESCOc1cc(NC(C)=O)ccc1O