Reaction Details
TargetCannabinoid receptor 1
LigandBDBM50246638
Substrate/Competitorn/a
Meas. Tech.ChEMBL_561999 (CHEMBL1010062)
Ki 300±n/a nM
Citation Sinning, CWatzer, BCoste, ONüsing, RMOtt, ILigresti, ADi Marzo, VImming, P New analgesics synthetically derived from the paracetamol metabolite N-(4-hydroxyphenyl)-(5Z,8Z,11Z,14Z)-icosatetra-5,8,11,14-enamide. J Med Chem51:7800-5 (2008) 
 
Cannabinoid receptor 1
Name:Cannabinoid receptor 1
Type:G Protein-Coupled Receptor (GPCR)
Mol. Mass.:52868.96
Organism:Homo sapiens (Human)
Description:P21554
Residue:472
BDBM50246638
NameBDBM50246638
Synonyms:CHEMBL472897 | N-(1H-indazol-5-yl)icosa-5,8,11,14-tetraenamide
TypeSmall organic molecule
Emp. Form.C27H37N3O
Mol. Mass.419.6022
SMILESCCCCC\C=C/C\C=C/C\C=C/C\C=C/CCCC(=O)Nc1ccc2[nH]ncc2c1