Reaction Details
TargetCannabinoid receptor 2
LigandBDBM50054471
Substrate/Competitorn/a
Meas. Tech.ChEMBL_562000 (CHEMBL1010063)
Ki 1300±n/a nM
Citation Sinning, CWatzer, BCoste, ONüsing, RMOtt, ILigresti, ADi Marzo, VImming, P New analgesics synthetically derived from the paracetamol metabolite N-(4-hydroxyphenyl)-(5Z,8Z,11Z,14Z)-icosatetra-5,8,11,14-enamide. J Med Chem51:7800-5 (2008) 
 
Cannabinoid receptor 2
Name:Cannabinoid receptor 2
Type:G Protein-Coupled Receptor (GPCR)
Mol. Mass.:39690.94
Organism:Homo sapiens (Human)
Description:P34972
Residue:360
BDBM50054471
NameBDBM50054471
Synonyms:(5Z,8Z)-Icosa-5,8,11,14-tetraenoic acid (4-hydroxy-phenyl)-amide (5Z,8Z,11Z,14Z)-N-(4-hydroxyphenyl)icosa-5,8,11,14-tetraenamide AM-404 CHEMBL39878 N-(4-hydroxyphenyl)-(5Z,8Z,11Z,14Z)-icosatetra-5,8,11,14-enamide cid_6604822
TypeSmall organic molecule
Emp. Form.C26H37NO2
Mol. Mass.395.5775
SMILESCCCCC\C=C/C\C=C/C\C=C/C\C=C/CCCC(=O)Nc1ccc(O)cc1