Reaction Details
TargetCyclin-dependent kinase 2
LigandBDBM50246730
Substrate/Competitorn/a
Meas. Tech.ChEMBL_557682 (CHEMBL962977)
IC50 4300±n/a nM
Citation Danilenko, VNSimonov, AYLakatosh, SAKubbutat, MHTotzke, FSchächtele, CElizarov, SMBekker, OBPrintsevskaya, SSLuzikov, YNReznikova, MIShtil, AAPreobrazhenskaya, MN Search for inhibitors of bacterial and human protein kinases among derivatives of diazepines[1,4] annelated with maleimide and indole cycles. J Med Chem51:7731-6 (2008) 
 
Cyclin-dependent kinase 2
Name:Cyclin-dependent kinase 2
Type:Enzyme Subunit
Mol. Mass.:33938.17
Organism:Homo sapiens (Human)
Description:P24941
Residue:298
BDBM50246730
NameBDBM50246730
Synonyms:3-(1,3-Dioxo-1,3,9b,10-tetrahydro-2H-indolo[1',7':4,5,6]pyrrolo[3',4':2,3][1,4] diazepino[1,7-a]indol-2-yl)propyl Imidothiocarbamate | CHEMBL514316
TypeSmall organic molecule
Emp. Form.C24H21N5O2S
Mol. Mass.443.521
SMILESNC(=N)SCCCN1C(=O)C2=C(C1=O)n1ccc3cccc(C4Cc5ccccc5N24)c13