Reaction Details
TargetProto-oncogene tyrosine-protein kinase Src
LigandBDBM50246774
Substrate/Competitorn/a
Meas. Tech.ChEMBL_557463 (CHEMBL962241)
IC50 3800±n/a nM
Citation Danilenko, VNSimonov, AYLakatosh, SAKubbutat, MHTotzke, FSchächtele, CElizarov, SMBekker, OBPrintsevskaya, SSLuzikov, YNReznikova, MIShtil, AAPreobrazhenskaya, MN Search for inhibitors of bacterial and human protein kinases among derivatives of diazepines[1,4] annelated with maleimide and indole cycles. J Med Chem51:7731-6 (2008) 
 
Proto-oncogene tyrosine-protein kinase Src
Name:Proto-oncogene tyrosine-protein kinase Src
Type:Protein
Mol. Mass.:59838.60
Organism:Homo sapiens (Human)
Description:P12931
Residue:536
BDBM50246774
NameBDBM50246774
Synonyms:3-(1,3-Dioxo-1,3-dihydro-2H-indolo[1',7':4,5,6]pyrrolo[3',4':2,3][1,4]diazepino[1,7-a]indol-2-yl)propyl Imidothiocarbamate | CHEMBL489083
TypeSmall organic molecule
Emp. Form.C24H19N5O2S
Mol. Mass.441.505
SMILESNC(=N)SCCCn1c(=O)c2c(n3c(cc4ccccc34)c3cccc4ccn2c34)c1=O