Reaction Details
TargetC-C chemokine receptor type 4
LigandBDBM50265670
Substrate/Competitorn/a
Meas. Tech.ChEMBL_558790 (CHEMBL1020783)
IC50 52±n/a nM
Citation Yokoyama, KIshikawa, NIgarashi, SKawano, NMasuda, NHamaguchi, WYamasaki, SKoganemaru, YHattori, KMiyazaki, TOgino, SMatsumoto, YTakeuchi, MOhta, M Potent and orally bioavailable CCR4 antagonists: Synthesis and structure-activity relationship study of 2-aminoquinazolines. Bioorg Med Chem17:64-73 (2008) 
 
C-C chemokine receptor type 4
Name:C-C chemokine receptor type 4
Type:Enzyme
Mol. Mass.:41406.41
Organism:Homo sapiens (Human)
Description:P51679
Residue:360
BDBM50265670
NameBDBM50265670
Synonyms:CHEMBL526474 | N-(4-Chlorophenyl)-6,7-dimethoxy-2-[3-(methoxymethyl)-1,4'-bipiperidin-1'-yl]quinazolin-4-amine
TypeSmall organic molecule
Emp. Form.C28H36ClN5O3
Mol. Mass.526.07
SMILESCOCC1CCCN(C1)C1CCN(CC1)c1nc(Nc2ccc(Cl)cc2)c2cc(OC)c(OC)cc2n1