Reaction Details
TargetSphingosine 1-phosphate receptor 3
LigandBDBM50158348
Substrate/Competitorn/a
Meas. Tech.ChEMBL_540419 (CHEMBL1029036)
IC50 0.66±n/a nM
Citation Evindar, GBernier, SGKavarana, MJDoyle, ELorusso, JKelley, MSHalley, KHutchings, AWright, ADSaha, AKHannig, GMorgan, BAWestlin, WF Synthesis and evaluation of alkoxy-phenylamides and alkoxy-phenylimidazoles as potent sphingosine-1-phosphate receptor subtype-1 agonists. Bioorg Med Chem Lett19:369-72 (2008) 
 
Sphingosine 1-phosphate receptor 3
Name:Sphingosine 1-phosphate receptor 3
Type:G Protein-Coupled Receptor (GPCR)
Mol. Mass.:42278.13
Organism:Homo sapiens (Human)
Description:Q99500
Residue:378
BDBM50158348
NameBDBM50158348
Synonyms:(2S,3R,4E)-2-amino-3-hydroxyoctadec-4-en-1-yl dihydrogen phosphate CHEMBL225155 US11584726, Example S1P sphingosine-1-phosphate
TypeSmall organic molecule
Emp. Form.C18H38NO5P
Mol. Mass.379.4718
SMILESCCCCCCCCCCCCC\C=C\[C@@H](O)[C@@H](N)COP(O)(O)=O