Reaction Details
TargetSphingosine 1-phosphate receptor 5
LigandBDBM50277148
Substrate/Competitorn/a
Meas. Tech.ChEMBL_540421 (CHEMBL1029038)
IC50 8.8±n/a nM
Citation Evindar, GBernier, SGKavarana, MJDoyle, ELorusso, JKelley, MSHalley, KHutchings, AWright, ADSaha, AKHannig, GMorgan, BAWestlin, WF Synthesis and evaluation of alkoxy-phenylamides and alkoxy-phenylimidazoles as potent sphingosine-1-phosphate receptor subtype-1 agonists. Bioorg Med Chem Lett19:369-72 (2008) 
 
Sphingosine 1-phosphate receptor 5
Name:Sphingosine 1-phosphate receptor 5
Type:G Protein-Coupled Receptor (GPCR)
Mol. Mass.:41796.42
Organism:Homo sapiens (Human)
Description:n/a
Residue:398
BDBM50277148
NameBDBM50277148
Synonyms:(S)-2-amino-2-methyl-3-(4-(octyloxy)phenylamino)-3-oxopropyl dihydrogen phosphate | CHEMBL475495
TypeSmall organic molecule
Emp. Form.C18H31N2O6P
Mol. Mass.402.4223
SMILESCCCCCCCCOc1ccc(NC(=O)[C@@](C)(N)COP(O)(O)=O)cc1