Reaction Details
TargetSphingosine 1-phosphate receptor 1
LigandBDBM50277185
Substrate/Competitorn/a
Meas. Tech.ChEMBL_540418 (CHEMBL1029035)
IC50 0.35±n/a nM
Citation Evindar, GBernier, SGKavarana, MJDoyle, ELorusso, JKelley, MSHalley, KHutchings, AWright, ADSaha, AKHannig, GMorgan, BAWestlin, WF Synthesis and evaluation of alkoxy-phenylamides and alkoxy-phenylimidazoles as potent sphingosine-1-phosphate receptor subtype-1 agonists. Bioorg Med Chem Lett19:369-72 (2008) 
 
Sphingosine 1-phosphate receptor 1
Name:Sphingosine 1-phosphate receptor 1
Type:Enzyme
Mol. Mass.:42836.02
Organism:Homo sapiens (Human)
Description:P21453
Residue:382
BDBM50277185
NameBDBM50277185
Synonyms:(S)-2-amino-3-(2-fluoro-4-(octyloxy)phenylamino)-2-methyl-3-oxopropyl dihydrogen phosphate | CHEMBL474688
TypeSmall organic molecule
Emp. Form.C18H30FN2O6P
Mol. Mass.420.4128
SMILESCCCCCCCCOc1ccc(NC(=O)[C@@](C)(N)COP(O)(O)=O)c(F)c1