Reaction Details
TargetCytochrome P450 2C9
LigandBDBM50256329
Substrate/Competitorn/a
Meas. Tech.ChEMBL_515053 (CHEMBL1034795)
IC50>33000±n/a nM
Citation Sparks, SMBanker, PBickett, DMCarter, HLClancy, DCDickerson, SHDwornik, KAGarrido, DMGolden, PLNolte, RTPeat, AJSheckler, LRTavares, FXThomson, SAWang, LWeiel, JE Anthranilimide-based glycogen phosphorylase inhibitors for the treatment of type 2 diabetes: 1. Identification of 1-amino-1-cycloalkyl carboxylic acid headgroups. Bioorg Med Chem Lett19:976-80 (2009) 
 
Cytochrome P450 2C9
Name:Cytochrome P450 2C9
Type:Enzyme
Mol. Mass.:55636.33
Organism:Homo sapiens (Human)
Description:P11712
Residue:490
BDBM50256329
NameBDBM50256329
Synonyms:1-(3-(3-mesitylureido)-2-naphthamido)cyclooctanecarboxylic acid | CHEMBL481534
TypeSmall organic molecule
Emp. Form.C30H35N3O4
Mol. Mass.501.6166
SMILESCc1cc(C)c(NC(=O)Nc2cc3ccccc3cc2C(=O)NC2(CCCCCCC2)C(O)=O)c(C)c1