Reaction Details
TargetGlycogen phosphorylase, liver form
LigandBDBM50256573
Substrate/Competitorn/a
Meas. Tech.ChEMBL_515065 (CHEMBL1034807)
IC50 9±n/a nM
Citation Sparks, SMBanker, PBickett, DMClancy, DCDickerson, SHGarrido, DMGolden, PLPeat, AJSheckler, LRTavares, FXThomson, SAWeiel, JE Anthranilimide-based glycogen phosphorylase inhibitors for the treatment of Type 2 diabetes: 2. Optimization of serine and threonine ether amino acid residues. Bioorg Med Chem Lett19:981-5 (2009) 
 
Glycogen phosphorylase, liver form
Name:Glycogen phosphorylase, liver form
Type:Homodimer
Mol. Mass.:97153.98
Organism:Homo sapiens (Human)
Description:Dimers associate into a tetramer to form the enzymatically active phosphorylase A.
Residue:847
BDBM50256573
NameBDBM50256573
Synonyms:(S)-2-(3-(3-mesitylureido)-2-naphthamido)-5-methylhexanoic acid | CHEMBL516081
TypeSmall organic molecule
Emp. Form.C28H33N3O4
Mol. Mass.475.5793
SMILESCC(C)CC[C@H](NC(=O)c1cc2ccccc2cc1NC(=O)Nc1c(C)cc(C)cc1C)C(O)=O