Reaction Details
TargetCytochrome P450 2C9
LigandBDBM50256667
Substrate/Competitorn/a
Meas. Tech.ChEMBL_515067 (CHEMBL1034809)
IC50 14000±n/a nM
Citation Sparks, SMBanker, PBickett, DMClancy, DCDickerson, SHGarrido, DMGolden, PLPeat, AJSheckler, LRTavares, FXThomson, SAWeiel, JE Anthranilimide-based glycogen phosphorylase inhibitors for the treatment of Type 2 diabetes: 2. Optimization of serine and threonine ether amino acid residues. Bioorg Med Chem Lett19:981-5 (2009) 
 
Cytochrome P450 2C9
Name:Cytochrome P450 2C9
Type:Enzyme
Mol. Mass.:55636.33
Organism:Homo sapiens (Human)
Description:P11712
Residue:490
BDBM50256667
NameBDBM50256667
Synonyms:(2S,3R)-3-isopropoxy-2-(3-(3-mesitylureido)-2-naphthamido)butanoic acid | CHEMBL473850
TypeSmall organic molecule
Emp. Form.C28H33N3O5
Mol. Mass.491.5787
SMILESCC(C)O[C@H](C)[C@H](NC(=O)c1cc2ccccc2cc1NC(=O)Nc1c(C)cc(C)cc1C)C(O)=O