Reaction Details
TargetGlycogen phosphorylase, liver form
LigandBDBM50256668
Substrate/Competitorn/a
Meas. Tech.ChEMBL_515065 (CHEMBL1034807)
IC50 17±n/a nM
Citation Sparks, SMBanker, PBickett, DMClancy, DCDickerson, SHGarrido, DMGolden, PLPeat, AJSheckler, LRTavares, FXThomson, SAWeiel, JE Anthranilimide-based glycogen phosphorylase inhibitors for the treatment of Type 2 diabetes: 2. Optimization of serine and threonine ether amino acid residues. Bioorg Med Chem Lett19:981-5 (2009) 
 
Glycogen phosphorylase, liver form
Name:Glycogen phosphorylase, liver form
Type:Homodimer
Mol. Mass.:97153.98
Organism:Homo sapiens (Human)
Description:Dimers associate into a tetramer to form the enzymatically active phosphorylase A.
Residue:847
BDBM50256668
NameBDBM50256668
Synonyms:(2S,3R)-3-cyclobutoxy-2-(3-(3-mesitylureido)-2-naphthamido)butanoic acid | CHEMBL473852
TypeSmall organic molecule
Emp. Form.C29H33N3O5
Mol. Mass.503.5894
SMILESC[C@@H](OC1CCC1)[C@H](NC(=O)c1cc2ccccc2cc1NC(=O)Nc1c(C)cc(C)cc1C)C(O)=O