Reaction Details
TargetCytochrome P450 2C9
LigandBDBM50256636
Substrate/Competitorn/a
Meas. Tech.ChEMBL_519314 (CHEMBL947766)
IC50 4900±n/a nM
Citation Lyne, PDAquila, BCook, DJDakin, LAEzhuthachan, JIoannidis, SPontz, TSu, MYe, QZheng, XBlock, MHCowen, SDeegan, TLLee, JWScott, DACusteau, DDrew, LPoondru, SShen, MWu, A Identification of amidoheteroaryls as potent inhibitors of mutant (V600E) B-Raf kinase with in vivo activity. Bioorg Med Chem Lett19:1026-9 (2009) 
 
Cytochrome P450 2C9
Name:Cytochrome P450 2C9
Type:Enzyme
Mol. Mass.:55636.33
Organism:Homo sapiens (Human)
Description:P11712
Residue:490
BDBM50256636
NameBDBM50256636
Synonyms:5-(3-(2-cyanopropan-2-yl)benzamido)-2-methyl-N-(6-(methylamino)pyridin-3-yl)benzamide | CHEMBL475045
TypeSmall organic molecule
Emp. Form.C25H25N5O2
Mol. Mass.427.4983
SMILESCNc1ccc(NC(=O)c2cc(NC(=O)c3cccc(c3)C(C)(C)C#N)ccc2C)cn1