Reaction Details
TargetInsulin-like growth factor 1 receptor
LigandBDBM50256465
Substrate/Competitorn/a
Meas. Tech.ChEMBL_519403 (CHEMBL948824)
IC50 509±n/a nM
Citation Emmitte, KAWilson, BJBaum, EWEmerson, HKKuntz, KWNailor, KESalovich, JMSmith, SCCheung, MGerding, RMStevens, KLUehling, DEMook, RAMoorthy, GSDickerson, SHHassell, AMLeesnitzer, MAShewchuk, LMGroy, ARowand, JLAnderson, KAtkins, CLYang, JSabbatini, PKumar, R Discovery and optimization of imidazo[1,2-a]pyridine inhibitors of insulin-like growth factor-1 receptor (IGF-1R). Bioorg Med Chem Lett19:1004-8 (2009) 
 
Insulin-like growth factor 1 receptor
Name:Insulin-like growth factor 1 receptor
Type:Protein
Mol. Mass.:154776.79
Organism:Homo sapiens (Human)
Description:P08069
Residue:1367
BDBM50256465
NameBDBM50256465
Synonyms:CHEMBL480544 | N-(2,6-difluorophenyl)-3-(3-(2-(3-fluorophenylamino)pyrimidin-4-yl)imidazo[1,2-a]pyridin-2-yl)benzamide
TypeSmall organic molecule
Emp. Form.C30H19F3N6O
Mol. Mass.536.5067
SMILESFc1cccc(Nc2nccc(n2)-c2c(nc3ccccn23)-c2cccc(c2)C(=O)Nc2c(F)cccc2F)c1