Reaction Details
TargetInsulin-like growth factor 1 receptor
LigandBDBM50256474
Substrate/Competitorn/a
Meas. Tech.ChEMBL_519402 (CHEMBL948823)
IC50 2±n/a nM
Citation Emmitte, KAWilson, BJBaum, EWEmerson, HKKuntz, KWNailor, KESalovich, JMSmith, SCCheung, MGerding, RMStevens, KLUehling, DEMook, RAMoorthy, GSDickerson, SHHassell, AMLeesnitzer, MAShewchuk, LMGroy, ARowand, JLAnderson, KAtkins, CLYang, JSabbatini, PKumar, R Discovery and optimization of imidazo[1,2-a]pyridine inhibitors of insulin-like growth factor-1 receptor (IGF-1R). Bioorg Med Chem Lett19:1004-8 (2009) 
 
Insulin-like growth factor 1 receptor
Name:Insulin-like growth factor 1 receptor
Type:Protein
Mol. Mass.:154776.79
Organism:Homo sapiens (Human)
Description:P08069
Residue:1367
BDBM50256474
NameBDBM50256474
Synonyms:(R)-N-(2,6-difluorophenyl)-3-(3-(2-(4-(4-(3-fluoropyrrolidin-1-yl)piperidin-1-yl)-2-methoxyphenylamino)pyrimidin-4-yl)imidazo[1,2-a]pyridin-2-yl)benzamide | CHEMBL508627
TypeSmall organic molecule
Emp. Form.C40H37F3N8O2
Mol. Mass.718.7694
SMILESCOc1cc(ccc1Nc1nccc(n1)-c1c(nc2ccccn12)-c1cccc(c1)C(=O)Nc1c(F)cccc1F)N1CCC(CC1)N1CC[C@@H](F)C1