Reaction Details
TargetAurora kinase B
LigandBDBM50256479
Substrate/Competitorn/a
Meas. Tech.ChEMBL_519647 (CHEMBL946774)
IC50 1300±n/a nM
Citation Emmitte, KAWilson, BJBaum, EWEmerson, HKKuntz, KWNailor, KESalovich, JMSmith, SCCheung, MGerding, RMStevens, KLUehling, DEMook, RAMoorthy, GSDickerson, SHHassell, AMLeesnitzer, MAShewchuk, LMGroy, ARowand, JLAnderson, KAtkins, CLYang, JSabbatini, PKumar, R Discovery and optimization of imidazo[1,2-a]pyridine inhibitors of insulin-like growth factor-1 receptor (IGF-1R). Bioorg Med Chem Lett19:1004-8 (2009) 
 
Aurora kinase B
Name:Aurora kinase B
Type:Protein
Mol. Mass.:39327.72
Organism:Homo sapiens (Human)
Description:Q96GD4
Residue:344
BDBM50256479
NameBDBM50256479
Synonyms:CHEMBL448929 | N-(2,6-difluorophenyl)-3-(3-(2-(5-ethyl-2-methoxy-4-(4-(4-(methylsulfonyl)piperazin-1-yl)piperidin-1-yl)phenylamino)pyrimidin-4-yl)imidazo[1,2-a]pyridin-2-yl)benzamide
TypeSmall organic molecule
Emp. Form.C43H45F2N9O4S
Mol. Mass.821.937
SMILESCCc1cc(Nc2nccc(n2)-c2c(nc3ccccn23)-c2cccc(c2)C(=O)Nc2c(F)cccc2F)c(OC)cc1N1CCC(CC1)N1CCN(CC1)S(C)(=O)=O