Reaction Details
TargetInsulin-like growth factor 1 receptor
LigandBDBM50256471
Substrate/Competitorn/a
Meas. Tech.ChEMBL_519403 (CHEMBL948824)
IC50 38±n/a nM
Citation Emmitte, KAWilson, BJBaum, EWEmerson, HKKuntz, KWNailor, KESalovich, JMSmith, SCCheung, MGerding, RMStevens, KLUehling, DEMook, RAMoorthy, GSDickerson, SHHassell, AMLeesnitzer, MAShewchuk, LMGroy, ARowand, JLAnderson, KAtkins, CLYang, JSabbatini, PKumar, R Discovery and optimization of imidazo[1,2-a]pyridine inhibitors of insulin-like growth factor-1 receptor (IGF-1R). Bioorg Med Chem Lett19:1004-8 (2009) 
 
Insulin-like growth factor 1 receptor
Name:Insulin-like growth factor 1 receptor
Type:Protein
Mol. Mass.:154776.79
Organism:Homo sapiens (Human)
Description:P08069
Residue:1367
BDBM50256471
NameBDBM50256471
Synonyms:3-(3-(2-(4-(1,4'-bipiperidin-1'-yl)-2-methoxyphenylamino)pyrimidin-4-yl)imidazo[1,2-a]pyridin-2-yl)-N-(2,6-difluorophenyl)benzamide | CHEMBL506862
TypeSmall organic molecule
Emp. Form.C41H40F2N8O2
Mol. Mass.714.8055
SMILESCOc1cc(ccc1Nc1nccc(n1)-c1c(nc2ccccn12)-c1cccc(c1)C(=O)Nc1c(F)cccc1F)N1CCC(CC1)N1CCCCC1