Reaction Details
TargetInsulin-like growth factor 1 receptor
LigandBDBM50256468
Substrate/Competitorn/a
Meas. Tech.ChEMBL_519403 (CHEMBL948824)
IC50 174±n/a nM
Citation Emmitte, KAWilson, BJBaum, EWEmerson, HKKuntz, KWNailor, KESalovich, JMSmith, SCCheung, MGerding, RMStevens, KLUehling, DEMook, RAMoorthy, GSDickerson, SHHassell, AMLeesnitzer, MAShewchuk, LMGroy, ARowand, JLAnderson, KAtkins, CLYang, JSabbatini, PKumar, R Discovery and optimization of imidazo[1,2-a]pyridine inhibitors of insulin-like growth factor-1 receptor (IGF-1R). Bioorg Med Chem Lett19:1004-8 (2009) 
 
Insulin-like growth factor 1 receptor
Name:Insulin-like growth factor 1 receptor
Type:Protein
Mol. Mass.:154776.79
Organism:Homo sapiens (Human)
Description:P08069
Residue:1367
BDBM50256468
NameBDBM50256468
Synonyms:CHEMBL500003 | N-(2,6-difluorophenyl)-3-(3-(2-(4-(2-(piperidin-1-yl)ethyl)phenylamino)pyrimidin-4-yl)imidazo[1,2-a]pyridin-2-yl)benzamide
TypeSmall organic molecule
Emp. Form.C36H31F2N7O2
Mol. Mass.631.6738
SMILESFc1cccc(F)c1NC(=O)c1cccc(c1)-c1nc2ccccn2c1-c1ccnc(Nc2ccc(CCN3CCOCC3)cc2)n1