Reaction Details
TargetInsulin-like growth factor 1 receptor
LigandBDBM50256412
Substrate/Competitorn/a
Meas. Tech.ChEMBL_519403 (CHEMBL948824)
IC50 247±n/a nM
Citation Emmitte, KAWilson, BJBaum, EWEmerson, HKKuntz, KWNailor, KESalovich, JMSmith, SCCheung, MGerding, RMStevens, KLUehling, DEMook, RAMoorthy, GSDickerson, SHHassell, AMLeesnitzer, MAShewchuk, LMGroy, ARowand, JLAnderson, KAtkins, CLYang, JSabbatini, PKumar, R Discovery and optimization of imidazo[1,2-a]pyridine inhibitors of insulin-like growth factor-1 receptor (IGF-1R). Bioorg Med Chem Lett19:1004-8 (2009) 
 
Insulin-like growth factor 1 receptor
Name:Insulin-like growth factor 1 receptor
Type:Protein
Mol. Mass.:154776.79
Organism:Homo sapiens (Human)
Description:P08069
Residue:1367
BDBM50256412
NameBDBM50256412
Synonyms:CHEMBL447450 | N-(2,6-difluorophenyl)-3-(3-(2-(3-(pyrrolidin-1-ylmethyl)phenylamino)pyrimidin-4-yl)imidazo[1,2-a]pyridin-2-yl)benzamide
TypeSmall organic molecule
Emp. Form.C35H29F2N7O
Mol. Mass.601.6479
SMILESFc1cccc(F)c1NC(=O)c1cccc(c1)-c1nc2ccccn2c1-c1ccnc(Nc2cccc(CN3CCCC3)c2)n1