Reaction Details
TargetPlatelet-derived growth factor receptor beta
LigandBDBM4811
Substrate/Competitorn/a
Meas. Tech.ChEMBL_515178 (CHEMBL1028055)
IC50 50±n/a nM
Citation Kammasud, NBoonyarat, CSanphanya, KUtsintong, MTsunoda, SSakurai, HSaiki, IAndré, IGrierson, DSVajragupta, O 5-Substituted pyrido[2,3-d]pyrimidine, an inhibitor against three receptor tyrosine kinases. Bioorg Med Chem Lett19:745-50 (2009) 
 
Platelet-derived growth factor receptor beta
Name:Platelet-derived growth factor receptor beta
Type:Enzyme
Mol. Mass.:123922.25
Organism:Homo sapiens (Human)
Description:P09619
Residue:1106
BDBM4811
NameBDBM4811
Synonyms:(Z)-3-[2,4-dimethyl-5-(2-oxo-1,2-dihydro-indol-3-ylidenemethyl)-1H-pyrrol-3-yl]-propionic acid CHEMBL274654 | SU6668
TypeSmall organic molecule
Emp. Form.C18H18N2O3
Mol. Mass.310.3471
SMILESCc1[nH]c(\C=C2/C(=O)Nc3ccccc23)c(C)c1CCC(O)=O