Reaction Details
TargetPlatelet-derived growth factor receptor beta
LigandBDBM50217602
Substrate/Competitorn/a
Meas. Tech.ChEMBL_515178 (CHEMBL1028055)
IC50 780±n/a nM
Citation Kammasud, NBoonyarat, CSanphanya, KUtsintong, MTsunoda, SSakurai, HSaiki, IAndré, IGrierson, DSVajragupta, O 5-Substituted pyrido[2,3-d]pyrimidine, an inhibitor against three receptor tyrosine kinases. Bioorg Med Chem Lett19:745-50 (2009) 
 
Platelet-derived growth factor receptor beta
Name:Platelet-derived growth factor receptor beta
Type:Enzyme
Mol. Mass.:123922.25
Organism:Homo sapiens (Human)
Description:P09619
Residue:1106
BDBM50217602
NameBDBM50217602
Synonyms:(Z)-3-(5-((6-(3,5-dimethoxyphenyl)-2-oxoindolin-3-ylidene)methyl)-2,4-dimethyl-1H-pyrrol-3-yl)propanoic acid CHEMBL231526
TypeSmall organic molecule
Emp. Form.C26H26N2O5
Mol. Mass.446.495
SMILESCOc1cc(OC)cc(c1)-c1ccc2\C(=C\c3[nH]c(C)c(CCC(O)=O)c3C)C(=O)Nc2c1