Reaction Details
TargetFibroblast growth factor receptor 1
LigandBDBM50256010
Substrate/Competitorn/a
Meas. Tech.ChEMBL_515176 (CHEMBL1028053)
IC50 100±n/a nM
Citation Kammasud, NBoonyarat, CSanphanya, KUtsintong, MTsunoda, SSakurai, HSaiki, IAndré, IGrierson, DSVajragupta, O 5-Substituted pyrido[2,3-d]pyrimidine, an inhibitor against three receptor tyrosine kinases. Bioorg Med Chem Lett19:745-50 (2009) 
 
Fibroblast growth factor receptor 1
Name:Fibroblast growth factor receptor 1
Type:Receptor
Mol. Mass.:91861.70
Organism:Homo sapiens (Human)
Description:P11362
Residue:822
BDBM50256010
NameBDBM50256010
Synonyms:3-{2,4-dimethyl-5-[2-oxo-5-(N'-phenylhydrazinocarbonyl)-1,2-dihydro-indol-3-ylidenemethyl]-1H-pyrrol-3-yl}-propionic acid | CHEMBL480356
TypeSmall organic molecule
Emp. Form.C25H24N4O4
Mol. Mass.444.4825
SMILESCc1[nH]c(\C=C2/C(=O)Nc3ccc(cc23)C(=O)NNc2ccccc2)c(C)c1CCC(O)=O