Reaction Details
TargetFibroblast growth factor receptor 1
LigandBDBM50265540
Substrate/Competitorn/a
Meas. Tech.ChEMBL_559889 (CHEMBL1010125)
IC50>25000±n/a nM
Citation Renhowe, PAPecchi, SShafer, CMMachajewski, TDJazan, EMTaylor, CAntonios-McCrea, WMcBride, CMFrazier, KWiesmann, MLapointe, GRFeucht, PHWarne, RLHeise, CCMenezes, DAardalen, KYe, HHe, MLe, VVora, JJansen, JMWernette-Hammond, MEHarris, AL Design, structure-activity relationships and in vivo characterization of 4-amino-3-benzimidazol-2-ylhydroquinolin-2-ones: a novel class of receptor tyrosine kinase inhibitors. J Med Chem52:278-92 (2009) 
 
Fibroblast growth factor receptor 1
Name:Fibroblast growth factor receptor 1
Type:Receptor
Mol. Mass.:91861.70
Organism:Homo sapiens (Human)
Description:P11362
Residue:822
BDBM50265540
NameBDBM50265540
Synonyms:4-Hydroxy-1-methyl-3-(1-methyl-1H-benzo[d]imidazol-2-yl)quinolin-2(1H)-one | CHEMBL496173
TypeSmall organic molecule
Emp. Form.C18H15N3O2
Mol. Mass.305.3306
SMILESCn1c(nc2ccccc12)-c1c(O)c2ccccc2n(C)c1=O