Reaction Details
TargetVascular endothelial growth factor receptor 2
LigandBDBM50265676
Substrate/Competitorn/a
Meas. Tech.ChEMBL_559888 (CHEMBL1010124)
IC50 29±n/a nM
Citation Renhowe, PAPecchi, SShafer, CMMachajewski, TDJazan, EMTaylor, CAntonios-McCrea, WMcBride, CMFrazier, KWiesmann, MLapointe, GRFeucht, PHWarne, RLHeise, CCMenezes, DAardalen, KYe, HHe, MLe, VVora, JJansen, JMWernette-Hammond, MEHarris, AL Design, structure-activity relationships and in vivo characterization of 4-amino-3-benzimidazol-2-ylhydroquinolin-2-ones: a novel class of receptor tyrosine kinase inhibitors. J Med Chem52:278-92 (2009) 
 
Vascular endothelial growth factor receptor 2
Name:Vascular endothelial growth factor receptor 2
Type:Receptor Tyrosine Kinase
Mol. Mass.:151510.97
Organism:Homo sapiens (Human)
Description:P35968
Residue:1356
BDBM50265676
NameBDBM50265676
Synonyms:CHEMBL495962 | N-(2-(4-Amino-2-oxo-1,2-dihydroquinolin-3-yl)-1H-benzo[d]imidazol-6-yl)-2-(dimethylamino)-N-methylacetamide
TypeSmall organic molecule
Emp. Form.C21H22N6O2
Mol. Mass.390.4384
SMILESCN(C)CC(=O)N(C)c1ccc2nc([nH]c2c1)-c1c(N)c2ccccc2[nH]c1=O