Reaction Details
TargetVascular endothelial growth factor receptor 2
LigandBDBM50265614
Substrate/Competitorn/a
Meas. Tech.ChEMBL_559888 (CHEMBL1010124)
IC50 220±n/a nM
Citation Renhowe, PAPecchi, SShafer, CMMachajewski, TDJazan, EMTaylor, CAntonios-McCrea, WMcBride, CMFrazier, KWiesmann, MLapointe, GRFeucht, PHWarne, RLHeise, CCMenezes, DAardalen, KYe, HHe, MLe, VVora, JJansen, JMWernette-Hammond, MEHarris, AL Design, structure-activity relationships and in vivo characterization of 4-amino-3-benzimidazol-2-ylhydroquinolin-2-ones: a novel class of receptor tyrosine kinase inhibitors. J Med Chem52:278-92 (2009) 
 
Vascular endothelial growth factor receptor 2
Name:Vascular endothelial growth factor receptor 2
Type:Receptor Tyrosine Kinase
Mol. Mass.:151510.97
Organism:Homo sapiens (Human)
Description:P35968
Residue:1356
BDBM50265614
NameBDBM50265614
Synonyms:4-Amino-3-(6-methylbenzimidazol-2-yl)hydroquinolin-2-one | CHEMBL498205
TypeSmall organic molecule
Emp. Form.C17H14N4O
Mol. Mass.290.3193
SMILESCc1ccc2nc([nH]c2c1)-c1c(N)c2ccccc2[nH]c1=O