Reaction Details
TargetVascular endothelial growth factor receptor 2
LigandBDBM50265786
Substrate/Competitorn/a
Meas. Tech.ChEMBL_559888 (CHEMBL1010124)
IC50 6500±n/a nM
Citation Renhowe, PAPecchi, SShafer, CMMachajewski, TDJazan, EMTaylor, CAntonios-McCrea, WMcBride, CMFrazier, KWiesmann, MLapointe, GRFeucht, PHWarne, RLHeise, CCMenezes, DAardalen, KYe, HHe, MLe, VVora, JJansen, JMWernette-Hammond, MEHarris, AL Design, structure-activity relationships and in vivo characterization of 4-amino-3-benzimidazol-2-ylhydroquinolin-2-ones: a novel class of receptor tyrosine kinase inhibitors. J Med Chem52:278-92 (2009) 
 
Vascular endothelial growth factor receptor 2
Name:Vascular endothelial growth factor receptor 2
Type:Receptor Tyrosine Kinase
Mol. Mass.:151510.97
Organism:Homo sapiens (Human)
Description:P35968
Residue:1356
BDBM50265786
NameBDBM50265786
Synonyms:4-Amino-3-benzimidazol-2-yl-6-(4-methylpiperazinyl)hydroquinolin-2-one | CHEMBL457985
TypeSmall organic molecule
Emp. Form.C21H22N6O
Mol. Mass.374.439
SMILESCN1CCN(CC1)c1ccc2[nH]c(=O)c(-c3nc4ccccc4[nH]3)c(N)c2c1