Reaction Details
TargetFibroblast growth factor receptor 1
LigandBDBM50265641
Substrate/Competitorn/a
Meas. Tech.ChEMBL_559889 (CHEMBL1010125)
IC50 10±n/a nM
Citation Renhowe, PAPecchi, SShafer, CMMachajewski, TDJazan, EMTaylor, CAntonios-McCrea, WMcBride, CMFrazier, KWiesmann, MLapointe, GRFeucht, PHWarne, RLHeise, CCMenezes, DAardalen, KYe, HHe, MLe, VVora, JJansen, JMWernette-Hammond, MEHarris, AL Design, structure-activity relationships and in vivo characterization of 4-amino-3-benzimidazol-2-ylhydroquinolin-2-ones: a novel class of receptor tyrosine kinase inhibitors. J Med Chem52:278-92 (2009) 
 
Fibroblast growth factor receptor 1
Name:Fibroblast growth factor receptor 1
Type:Receptor
Mol. Mass.:91861.70
Organism:Homo sapiens (Human)
Description:P11362
Residue:822
BDBM50265641
NameBDBM50265641
Synonyms:4-Amino-3-{6-[(4-methylpiperazinyl)carbonyl]benzimidazol-2-yl}hydroquinolin-2-one | CHEMBL498214
TypeSmall organic molecule
Emp. Form.C22H22N6O2
Mol. Mass.402.4491
SMILESCN1CCN(CC1)C(=O)c1ccc2nc([nH]c2c1)-c1c(N)c2ccccc2[nH]c1=O