Reaction Details
TargetFibroblast growth factor receptor 1
LigandBDBM50265746
Substrate/Competitorn/a
Meas. Tech.ChEMBL_559889 (CHEMBL1010125)
IC50 10±n/a nM
Citation Renhowe, PAPecchi, SShafer, CMMachajewski, TDJazan, EMTaylor, CAntonios-McCrea, WMcBride, CMFrazier, KWiesmann, MLapointe, GRFeucht, PHWarne, RLHeise, CCMenezes, DAardalen, KYe, HHe, MLe, VVora, JJansen, JMWernette-Hammond, MEHarris, AL Design, structure-activity relationships and in vivo characterization of 4-amino-3-benzimidazol-2-ylhydroquinolin-2-ones: a novel class of receptor tyrosine kinase inhibitors. J Med Chem52:278-92 (2009) 
 
Fibroblast growth factor receptor 1
Name:Fibroblast growth factor receptor 1
Type:Receptor
Mol. Mass.:91861.70
Organism:Homo sapiens (Human)
Description:P11362
Residue:822
BDBM50265746
NameBDBM50265746
Synonyms:CHEMBL526507 | {4-Amino-3-[6-(4-methylpiperazinyl)benzimidazol-2-yl]-2-oxo(6-hydroquinolyl)}-N-benzylcarboxamide
TypeSmall organic molecule
Emp. Form.C29H29N7O2
Mol. Mass.507.5863
SMILESCN1CCN(CC1)c1ccc2nc([nH]c2c1)-c1c(N)c2cc(ccc2[nH]c1=O)C(=O)NCc1ccccc1