Reaction Details
TargetFibroblast growth factor receptor 1
LigandBDBM50265753
Substrate/Competitorn/a
Meas. Tech.ChEMBL_559889 (CHEMBL1010125)
IC50 110±n/a nM
Citation Renhowe, PAPecchi, SShafer, CMMachajewski, TDJazan, EMTaylor, CAntonios-McCrea, WMcBride, CMFrazier, KWiesmann, MLapointe, GRFeucht, PHWarne, RLHeise, CCMenezes, DAardalen, KYe, HHe, MLe, VVora, JJansen, JMWernette-Hammond, MEHarris, AL Design, structure-activity relationships and in vivo characterization of 4-amino-3-benzimidazol-2-ylhydroquinolin-2-ones: a novel class of receptor tyrosine kinase inhibitors. J Med Chem52:278-92 (2009) 
 
Fibroblast growth factor receptor 1
Name:Fibroblast growth factor receptor 1
Type:Receptor
Mol. Mass.:91861.70
Organism:Homo sapiens (Human)
Description:P11362
Residue:822
BDBM50265753
NameBDBM50265753
Synonyms:4-Amino-6,7-difluoro-3-(6-(4-methylpiperazin-1-yl)-1H-benzo[ d]imidazol-2-yl)quinolin-2(1H)-one | CHEMBL522732
TypeSmall organic molecule
Emp. Form.C21H20F2N6O
Mol. Mass.410.4199
SMILESCN1CCN(CC1)c1ccc2nc([nH]c2c1)-c1c(N)c2cc(F)c(F)cc2[nH]c1=O