Reaction Details
TargetFibroblast growth factor receptor 1
LigandBDBM5327
Substrate/Competitorn/a
Meas. Tech.ChEMBL_559889 (CHEMBL1010125)
IC50 390±n/a nM
Citation Renhowe, PAPecchi, SShafer, CMMachajewski, TDJazan, EMTaylor, CAntonios-McCrea, WMcBride, CMFrazier, KWiesmann, MLapointe, GRFeucht, PHWarne, RLHeise, CCMenezes, DAardalen, KYe, HHe, MLe, VVora, JJansen, JMWernette-Hammond, MEHarris, AL Design, structure-activity relationships and in vivo characterization of 4-amino-3-benzimidazol-2-ylhydroquinolin-2-ones: a novel class of receptor tyrosine kinase inhibitors. J Med Chem52:278-92 (2009) 
 
Fibroblast growth factor receptor 1
Name:Fibroblast growth factor receptor 1
Type:Receptor
Mol. Mass.:91861.70
Organism:Homo sapiens (Human)
Description:P11362
Residue:822
BDBM5327
NameBDBM5327
Synonyms:2-quinolinone deriv. 2 CHEMBL118440
TypeSmall organic molecule
Emp. Form.C16H11N3O
Mol. Mass.261.278
SMILESO=c1[nH]c2ccccc2cc1-c1nc2ccccc2[nH]1