Reaction Details
TargetPlatelet-derived growth factor receptor beta
LigandBDBM50265752
Substrate/Competitorn/a
Meas. Tech.ChEMBL_559890 (CHEMBL1011001)
IC50 14±n/a nM
Citation Renhowe, PAPecchi, SShafer, CMMachajewski, TDJazan, EMTaylor, CAntonios-McCrea, WMcBride, CMFrazier, KWiesmann, MLapointe, GRFeucht, PHWarne, RLHeise, CCMenezes, DAardalen, KYe, HHe, MLe, VVora, JJansen, JMWernette-Hammond, MEHarris, AL Design, structure-activity relationships and in vivo characterization of 4-amino-3-benzimidazol-2-ylhydroquinolin-2-ones: a novel class of receptor tyrosine kinase inhibitors. J Med Chem52:278-92 (2009) 
 
Platelet-derived growth factor receptor beta
Name:Platelet-derived growth factor receptor beta
Type:Enzyme
Mol. Mass.:123922.25
Organism:Homo sapiens (Human)
Description:P09619
Residue:1106
BDBM50265752
NameBDBM50265752
Synonyms:4-Amino-8-fluoro-3-[6-(4-methylpiperazinyl)benzimidazol-2-yl]hydroquinolin-2-one | CHEMBL526836
TypeSmall organic molecule
Emp. Form.C21H21FN6O
Mol. Mass.392.4294
SMILESCN1CCN(CC1)c1ccc2nc([nH]c2c1)-c1c(N)c2cccc(F)c2[nH]c1=O